{"text_format":"2","workbook":"xlsx","n_sheets":3,"sheets":["Instructions","Immigration Statement","Parental Consent"],"not_rendered":{"charts":0,"images":3,"macros":1,"external_links":0,"defined_names":13,"comments":0,"pivot_tables":0},"unopened":[],"bounds":{"document_bytes":16777216,"sheet_cells":100000,"run_cost":"one","rows_first":2000,"rows_last":500,"rows_between":2000,"halvings":0,"cell_chars":16384,"cell_head_chars":4096},"cells_cut":0,"cells_raw":0,"read":"whole","date_system":"1900"}

{"sheet":"Instructions","index":0,"n_rows":33,"n_cols":9,"rows_kept":33,"cut":false,"hidden":false,"merged":[[34,3,34,4],[34,6,34,7],[12,2,12,9],[32,6,32,7],[26,3,26,9],[30,3,30,5],[15,2,15,10],[1,0,7,5],[33,3,33,4],[33,6,33,7],[10,0,10,10],[13,2,13,10],[14,2,14,10],[28,3,28,5],[9,0,9,10],[20,6,20,10],[17,0,17,10],[32,3,32,4],[20,0,20,2],[22,3,22,7]]}
[]
["Young Life Malibu Club\nBorder Crossing Documentation"]
{"$rows_empty":7}
["This packet is made available to you as a resource to simply assist you in getting the documentation for your group together before you go.\n\nIn order to cross the border from The United States to Canada all U.S. citizens age 16 or over must have a valid passport, passport card, or other travel document approved by the Department of Homeland Security. A special exception has been made for children age 18 and under travelling in a religious or school group.  These individuals may present an original or a copy of their birth certificate if no other option is available. Other options include a passport card or an enhanced driver's license.  A passport is still the best option for all travellers. A passport is required by both countries for anyone 19 and over."]
["Please follow these instructions to prepare the border crossing documents."]
[]
[null,"n","Enter your area's information below."]
[null,"n","Immigration Statement - Click on the Print button on the right of that page to print one copy. Have the trip leader sign it, to be given to the border agents."]
[null,"n","Parental Consent - Print one copy for each camper age 18 and under and have parents or guardians fill out the information and sign it. Signed copies must be on hand at the border crossings. The purpose of the Phone field for the parent or guardian is if a border agent would like to contact a parent to verify the validity of the document."]
[]
[]
["Complete the following information before proceeding."]
[]
[]
["YL Area Number",null,null,null,"YL Area Name"]
[]
["Trip Leader Name"]
[]
["Area Contact Information"]
[]
[null,null,"Street Address"]
[]
[null,null,"City",null,null,null,"State",null,"Zip"]
[]
[null,null,"Phone"]
[]
["Camp Trip Dates",{"$nulls":4},"to"]

{"sheet":"Immigration Statement","index":1,"n_rows":45,"n_cols":13,"rows_kept":45,"cut":false,"hidden":false,"merged":[[3,12,4,15],[6,12,7,15],[24,0,24,3],[24,5,24,7],[19,0,19,7],[13,1,13,4],[15,1,15,4],[23,0,23,3],[23,5,23,7]]}
[]
[]
[]
[{"$nulls":12},"Click here to print this form\nwith the YL Logo"]
[]
[]
[{"$nulls":12},"Clck here to print this form for\nletterhead without the YL Logo"]
[]
[]
[]
[]
[]
[]
["Group Name:",{"$f":"IF(Instructions!G21=\"\",\"\",\"Young Life \" & Instructions!G21)","v":""}]
[]
["Supervising Adult:",{"$f":"IF(Instructions!D23=\"\",\"\",Instructions!D23)","v":""}]
[]
["Camp Dates:",{"$f":"IF(Instructions!D33=\"\",\"\",Instructions!D33)","v":""},"to",{"$f":"IF(Instructions!G33=\"\",\"\",Instructions!G33)","v":""}]
[]
[{"$f":"\"The purpose of this letter is to certify that I, \" & B16& \", have obtained parental or legal guardian consent for each child 18 or under travelling in my care to cross the border from The United States into Canada.\"","v":"The purpose of this letter is to certify that I, , have obtained parental or legal guardian consent for each child 18 or under travelling in my care to cross the border from The United States into Canada."}]
[]
[]
[]
[]
["Signature of Supervising Adult",{"$nulls":4},"Date"]
{"$rows_empty":16}
[{"$f":"\"Young Life \" & Instructions!G21","v":"Young Life "}]
[{"$f":"Instructions!D27","v":0}]
[{"$f":"Instructions!D29 & \", \" &Instructions!H29& \" \" &Instructions!J29","v":",  "}]
[{"$f":"Instructions!D31","v":0}]

{"sheet":"Parental Consent","index":2,"n_rows":44,"n_cols":6,"rows_kept":44,"cut":false,"hidden":false,"merged":[[9,0,9,7],[25,0,25,3],[25,5,25,7],[13,1,13,4],[15,1,15,4],[21,0,21,7],[24,0,24,3],[24,5,24,7]]}
{"$rows_empty":9}
["BORDER CROSSING CONSENT - PARENT OR GUARDIAN"]
[]
[]
[]
["Group Name:",{"$f":"\"Young Life \" & Instructions!G21","v":"Young Life "}]
[]
["Supervising Adult:",{"$f":"IF(Instructions!D23=\"\",\"\",Instructions!D23)","v":""}]
[]
["Camp Dates:",{"$f":"IF(Instructions!D33=\"\",\"\",Instructions!D33)","v":""},"to",{"$f":"IF(Instructions!G33=\"\",\"\",Instructions!G33)","v":""}]
[]
[]
[]
["I ________________________________ give permission to the above mentioned chaperone to\n\naccompany _______________________________ across the border from The United States to\n\nCanada to attend Young Life Malibu Club located in Princess Louisa Inlet, British Columbia."]
[]
[]
[]
["Signature of Parent or Guardian",{"$nulls":4},"Date"]
[]
[]
["Parent/Guardian Name(s):",null,null,null,"Phone:"]
[{"$nulls":4},"Phone:"]
["Camper - Date of Birth:"]
["Camper - Place of Birth:"]
[]
["Camper Proof of Citizenship (Please Check One):"]
["Passport"]
["Birth Certificate & Photo ID"]
["Passport Card"]
["Enhanced DL"]
[]
[]
[{"$f":"\"Young Life \" &Instructions!G21","v":"Young Life "}]
[{"$f":"Instructions!D27","v":0}]
[{"$f":"Instructions!D29 & \", \" &Instructions!H29& \" \" &Instructions!J29","v":",  "}]
[{"$f":"Instructions!D31","v":0}]